BDBM50345795 CHEMBL1785007::E/Z-ethyl 2-methoxy-6-(6-(tetrahydro-2H-pyran-2-yloxy)hex-1-enyl)benzoate
SMILES CCOC(=O)c1c(OC)cccc1C=CCCCCOC1CCCCO1
InChI Key InChIKey=VKIKPGQXASGXBU-UHFFFAOYSA-N
Data  1 IC50
  Tab Delimited (TSV)   2D SDfile   Computed 3D by Vconf -m prep SDfile
Find this compound or compounds like it in BindingDB:
Activity Spreadsheet -- Enzyme Inhibition Constant Data from BindingDB
Found 1 hit for monomerid = 50345795
TargetGlyceraldehyde-3-phosphate dehydrogenase, glycosomal(Trypanosoma cruzi)
Universidade Federal De S£O Carlos
Curated by ChEMBL
LigandPNGBDBM50345795(CHEMBL1785007 | E/Z-ethyl 2-methoxy-6-(6-(tetrahyd...)
Affinity DataIC50: >3.00E+5nM. Assay description: Inhibition of Trypanosoma cruzi recombinant glycosomal GAPDH expressed in Escherichia coli using GAPDH and D-glyceraldehyde-3-phosphate
In DepthDetails ArticlePubMed