BDBM50346159 CHEMBL1783784::ethyl 2-(5-methoxy-2-(3-phenylisoxazol-5-yl)phenoxy)acetate
SMILES CCOC(=O)COc1cc(OC)ccc1-c1cc(no1)-c1ccccc1
InChI Key InChIKey=KTVQXTVONZKEFB-UHFFFAOYSA-N
Data  2 IC50
  Tab Delimited (TSV)   2D SDfile   Computed 3D by Vconf -m prep SDfile
Find this compound or compounds like it in BindingDB:
Activity Spreadsheet -- Enzyme Inhibition Constant Data from BindingDB
Found 2 hits for monomerid = 50346159
TargetTyrosine-protein phosphatase non-receptor type 1(Homo sapiens (Human))
Central Drug Research Institute
Curated by ChEMBL
LigandPNGBDBM50346159(CHEMBL1783784 | ethyl 2-(5-methoxy-2-(3-phenylisox...)
Affinity DataIC50:  5.25E+3nM. Assay description: Inhibition of protein tyrosine phosphatase-1B at 10 uM incubated for 10 mins using pNPP substrate in absence of Triton X-100 by modified Goldstein me...
In DepthDetails ArticlePubMed
TargetTyrosine-protein phosphatase non-receptor type 1(Homo sapiens (Human))
Central Drug Research Institute
Curated by ChEMBL
LigandPNGBDBM50346159(CHEMBL1783784 | ethyl 2-(5-methoxy-2-(3-phenylisox...)
Affinity DataIC50:  5.35E+3nM. Assay description: Inhibition of protein tyrosine phosphatase-1B at 10 uM incubated for 10 mins using pNPP substrate in presence of 0.01% Triton X-100 by modified Golds...
In DepthDetails ArticlePubMed