BDBM50346341 6-O-benzoyl-alpha-mangostin::CHEMBL1782245
SMILES [#6]-[#8]-c1c(-[#8]-[#6](=O)-c2ccccc2)cc2oc3cc(-[#8])c(-[#6]\[#6]=[#6](\[#6])-[#6])c(-[#8])c3c(=O)c2c1-[#6]\[#6]=[#6](\[#6])-[#6]
InChI Key InChIKey=PZHXWXLAJJOECM-UHFFFAOYSA-N
Data  1 IC50
  Tab Delimited (TSV)   2D SDfile   Computed 3D by Vconf -m prep SDfile
Find this compound or compounds like it in BindingDB:
Activity Spreadsheet -- Enzyme Inhibition Constant Data from BindingDB
Found 1 hit for monomerid = 50346341
TargetTranscription factor p65(Homo sapiens (Human))
The Ohio State University
Curated by ChEMBL
LigandPNGBDBM50346341(6-O-benzoyl-alpha-mangostin | CHEMBL1782245)
Affinity DataIC50: >1.00E+4nM. Assay description: Inhibition of NFkappa p65 in nuclear extract of human HeLa cells assessed as blockade of NFkappa p65 binding to biotinylated-consesus sequence by ELI...
In DepthDetails ArticlePubMed