BDBM50349330 SECNIDAZOLE
SMILES CC(O)Cn1c(C)ncc1[N+]([O-])=O
InChI Key InChIKey=KPQZUUQMTUIKBP-UHFFFAOYSA-N
Data  1 IC50
  Tab Delimited (TSV)   2D SDfile   Computed 3D by Vconf -m prep SDfile
Find this compound or compounds like it in BindingDB:
Activity Spreadsheet -- Enzyme Inhibition Constant Data from BindingDB
Found 1 hit for monomerid = 50349330
Target3-oxoacyl-[acyl-carrier-protein] synthase 3(Escherichia coli)
Nanjing University
Curated by ChEMBL
LigandPNGBDBM50349330(SECNIDAZOLE)
Affinity DataIC50:  2.85E+4nM. Assay description: Inhibition of N-terminal His-tagged Escherichia coli FabH expressed in Escherichia coli BL21 (DE3) using [3H]acetyl-coA after 25 mins by liquid scint...
In DepthDetails ArticlePubMed