BDBM50352226 CHEMBL1821879
SMILES Cc1ccc(cc1)C1CC(=NN1c1nc(cs1)-c1ccccc1)c1ccc(Br)cc1
InChI Key InChIKey=BXTBYPDPYTUYEU-UHFFFAOYSA-N
Data  1 IC50
  Tab Delimited (TSV)   2D SDfile   Computed 3D by Vconf -m prep SDfile
Find this compound or compounds like it in BindingDB:
Activity Spreadsheet -- Enzyme Inhibition Constant Data from BindingDB
Found 1 hit for monomerid = 50352226
TargetEpidermal growth factor receptor(Homo sapiens (Human))
Nanjing University
Curated by ChEMBL
LigandPNGBDBM50352226(CHEMBL1821879)
Affinity DataIC50:  1.96E+4nM. Assay description: Inhibition of recombinant (His)6-tagged EGFR cytoplasmic domain (645-1186) autophosphorylation pre-incubated for 10 mins measured after 1 hrs by DELF...
In DepthDetails ArticlePubMed