BDBM50356594 CHEMBL1909647
SMILES Cc1nc2C(=O)NCc2c(c1CN)-c1ccc(Cl)cc1Cl
InChI Key InChIKey=CVARTXOKUSBAQT-UHFFFAOYSA-N
Data  3 KI  1 IC50
  Tab Delimited (TSV)   2D SDfile   Computed 3D by Vconf -m prep SDfile
Find this compound or compounds like it in BindingDB:
Activity Spreadsheet -- Enzyme Inhibition Constant Data from BindingDB
Found 4 hits for monomerid = 50356594
TargetDipeptidyl peptidase 4(Homo sapiens (Human))
Bristol-Myers Squibb Research And Development
Curated by ChEMBL
LigandPNGBDBM50356594(CHEMBL1909647)
Affinity DataKi:  14nM. Assay description: Inhibition of DPP4
In DepthDetails ArticlePubMed
TargetDipeptidyl peptidase 8(Homo sapiens (Human))
Bristol-Myers Squibb Research And Development
Curated by ChEMBL
LigandPNGBDBM50356594(CHEMBL1909647)
Affinity DataKi: >3.00E+4nM. Assay description: Inhibition of DPP8
In DepthDetails ArticlePubMed
TargetDipeptidyl peptidase 9(Homo sapiens (Human))
Bristol-Myers Squibb Research And Development
Curated by ChEMBL
LigandPNGBDBM50356594(CHEMBL1909647)
Affinity DataKi: >3.00E+4nM. Assay description: Inhibition of DPP9
In DepthDetails ArticlePubMed
TargetCytochrome P450 3A4(Homo sapiens (Human))
Bristol-Myers Squibb Research And Development
Curated by ChEMBL
LigandPNGBDBM50356594(CHEMBL1909647)
Affinity DataIC50: >4.00E+4nM. Assay description: Inhibition of CYP3A4 in presence of the substrate 7-bezyloxy-4-trifluoromethyl coumarin
In DepthDetails ArticlePubMed