BDBM503606 US11034670, Ex. 46
SMILES CN\C(=C/C(=N)N1CCN(CC1)C(=O)CCc1nc2ccccc2c(=O)[nH]1)C#N
InChI Key InChIKey=SNIHOQWUMVGWSB-PPJCCZRMSA-N
Data  1 IC50
  Tab Delimited (TSV)   2D SDfile   Computed 3D by Vconf -m prep SDfile
Find this compound or compounds like it in BindingDB:
Activity Spreadsheet -- Enzyme Inhibition Constant Data from BindingDB
Found 1 hit for monomerid = 503606
TargetPoly [ADP-ribose] polymerase 1(Homo sapiens (Human))
Mitobridge
US Patent
LigandPNGBDBM503606(US11034670, Ex. 46)
Affinity DataIC50:  278nM. Assay description: The scintillation proximity assay (SPA) is designed to measure PARP activity using purified recombinant PARP-1 enzyme and is ideal for high throughpu...
Ligand InfoPC cidPC sid
In DepthDetails US Patent