BDBM50361647 CHEMBL1940244
SMILES CC(C)n1cc(C(=O)c2cncc(NCCc3cccnc3)n2)c2c(N)ncnc12
InChI Key InChIKey=WMUOCKJUZCEMCY-UHFFFAOYSA-N
Data  2 KI
PDB links: 1 PDB ID matches this monomer.
  Tab Delimited (TSV)   2D SDfile   Computed 3D by Vconf -m prep SDfile
Find this compound or compounds like it in BindingDB:
Activity Spreadsheet -- Enzyme Inhibition Constant Data from BindingDB
Found 2 hits for monomerid = 50361647
Target3-phosphoinositide-dependent protein kinase 1(Homo sapiens (Human))
Pfizer
Curated by ChEMBL
LigandPNGBDBM50361647(CHEMBL1940244)
Affinity DataKi:  35nM. Assay description: Inhibition of PDK1-mediated AKT1 phosphorylation at T308 in human H460 cells after 2 hrs by ELISA
LigandPNGBDBM50361647(CHEMBL1940244)
Affinity DataKi:  250nM. Assay description: Inhibition of mouse PI3Kalpha after 30 mins by fluorescence polarization assay
In DepthDetails ArticlePubMed