BDBM50368544 CHEMBL607498
SMILES Nc1nc(NCCC2CCCC=C2)nc2n(cnc12)C1O[C@H](CO)[C@@H](O)[C@H]1O
InChI Key InChIKey=UECDEODSHCIWLV-MQWPZHSDSA-N
Data  1 KI
  Tab Delimited (TSV)   2D SDfile   Computed 3D by Vconf -m prep SDfile
Find this compound or compounds like it in BindingDB:
Activity Spreadsheet -- Enzyme Inhibition Constant Data from BindingDB
Found 1 hit for monomerid = 50368544
TargetAdenosine receptor A1(Rattus norvegicus (rat))
Niddk
Curated by ChEMBL
LigandPNGBDBM50368544(CHEMBL607498)
Affinity DataKi:  2.70E+3nM. Assay description: Binding affinity against adenosine A1 receptor using [3H]-CHA or [3H]PIA as radioligand
In DepthDetails ArticlePubMed