BDBM50369370 CHEMBL1790745
SMILES CC[C@@H](C)[C@@H](CN[C@@H](Cc1ccccc1)C(=O)N[C@@H](CCSC)C(O)=O)NC[C@@H](N)CS
InChI Key InChIKey=HTQHKXXZLMCPEX-BVJIBDCISA-N
Data  2 IC50
  Tab Delimited (TSV)   2D SDfile   Computed 3D by Vconf -m prep SDfile
Find this compound or compounds like it in BindingDB:
Activity Spreadsheet -- Enzyme Inhibition Constant Data from BindingDB
Found 2 hits for monomerid = 50369370
TargetProtein farnesyltransferase subunit beta/geranylgeranyltransferase type-1 subunit alpha(Homo sapiens (Human))
Merck Research Laboratories
Curated by ChEMBL
LigandPNGBDBM50369370(CHEMBL1790745)
Affinity DataIC50:  4.80nM. Assay description: Inhibition of [3H]FPP incorporation into recombinant human Ha-Ras by Farnesyltransferase
In DepthDetails ArticlePubMed
LigandPNGBDBM50369370(CHEMBL1790745)
Affinity DataIC50:  5.75E+3nM. Assay description: Inhibition of bovine Geranylgeranyl transferase type I
In DepthDetails ArticlePubMed