BDBM50369467 CHEMBL435414
SMILES CC1CCC(CN2[C@H](CN3[C@H](CN=C23)C2CCCCC2)C2CCCCC2)CC1
InChI Key InChIKey=LQWPVDAXOTWZNJ-KBTIEJEYSA-N
Data  1 IC50
  Tab Delimited (TSV)   2D SDfile   Computed 3D by Vconf -m prep SDfile
Find this compound or compounds like it in BindingDB:
Activity Spreadsheet -- Enzyme Inhibition Constant Data from BindingDB
Found 1 hit for monomerid = 50369467
TargetKappa-type opioid receptor(Homo sapiens (Human))
Torrey Pines Institute For Molecular Studies
Curated by ChEMBL
LigandPNGBDBM50369467(CHEMBL435414)
Affinity DataIC50:  365nM. Assay description: Inhibitory activity for kappa opioid receptor
In DepthDetails ArticlePubMed