BDBM50372073 CHEMBL256220
SMILES CCOc1c2CN(C(=O)c2c(OCC)c2ccccc12)c1ccc(CS(=O)(=O)NC(=O)Cc2cc(OC)ccc2OC)cc1
InChI Key InChIKey=XVCXTZSYZRZZHF-UHFFFAOYSA-N
Data  2 KI
  Tab Delimited (TSV)   2D SDfile   Computed 3D by Vconf -m prep SDfile
Find this compound or compounds like it in BindingDB:
Activity Spreadsheet -- Enzyme Inhibition Constant Data from BindingDB
Found 2 hits for monomerid = 50372073
TargetProstaglandin E2 receptor EP4 subtype(Homo sapiens (Human))
Merck Frosst Centre For Therapeutic Research
Curated by ChEMBL
LigandPNGBDBM50372073(CHEMBL256220)
Affinity DataKi:  0.370nM. Assay description: Binding affinity to human EP4 receptor expressed in HEK293 cells
In DepthDetails ArticlePubMed
TargetProstaglandin E2 receptor EP4 subtype(Homo sapiens (Human))
Merck Frosst Centre For Therapeutic Research
Curated by ChEMBL
LigandPNGBDBM50372073(CHEMBL256220)
Affinity DataKi:  38nM. Assay description: Binding affinity to human EP4 receptor expressed in HEK293 cells in presence of 10% human serum
In DepthDetails ArticlePubMed