BDBM50379507 CHEMBL2012398
SMILES Cn1cc(Nc2ncc3cnn([C@H]4CC[C@H]5CCC[C@@H]45)c3n2)cc1C(N)=O
InChI Key InChIKey=XEXXLSSPQTWUID-DFBGVHRSSA-N
Data  3 IC50
  Tab Delimited (TSV)   2D SDfile   Computed 3D by Vconf -m prep SDfile
Find this compound or compounds like it in BindingDB:
Activity Spreadsheet -- Enzyme Inhibition Constant Data from BindingDB
Found 3 hits for monomerid = 50379507
TargetCyclin-dependent kinase 1(Homo sapiens (Human))
Biogen Idec
Curated by ChEMBL
LigandPNGBDBM50379507(CHEMBL2012398)
Affinity DataIC50:  16nM. Assay description: Inhibition of CDK1
In DepthDetails ArticlePubMed
TargetAurora kinase A(Homo sapiens (Human))
Biogen Idec
Curated by ChEMBL
LigandPNGBDBM50379507(CHEMBL2012398)
Affinity DataIC50:  21nM. Assay description: Inhibition of aurora A kinase
In DepthDetails ArticlePubMed
TargetAurora kinase B(Homo sapiens (Human))
Biogen Idec
Curated by ChEMBL
LigandPNGBDBM50379507(CHEMBL2012398)
Affinity DataIC50:  12nM. Assay description: Inhibition of aurora B kinase
In DepthDetails ArticlePubMed