BDBM50383374 CHEMBL2030555::CHEMBL2069960::US10544104, Compound 30::US11247972, Compound 30::US9765037, Compound 30
SMILES Nc1ncnc2n(CC3CCNCC3)nc(-c3cnc4ccccc4c3)c12
InChI Key InChIKey=JSONRPFPVGYCOB-UHFFFAOYSA-N
Data  2 KI  11 IC50
  Tab Delimited (TSV)   2D SDfile   Computed 3D by Vconf -m prep SDfile
Find this compound or compounds like it in BindingDB:
Activity Spreadsheet -- Enzyme Inhibition Constant Data from BindingDB
Found 13 hits for monomerid = 50383374
TargetTyrosine-protein kinase ABL1(Homo sapiens (Human))
University Of Washington
Curated by ChEMBL
LigandPNGBDBM50383374(CHEMBL2030555 | CHEMBL2069960 | US10544104, Compou...)
Affinity DataKi: >1.50E+4nM. Assay description: Inhibition of human ABL by radiometric assay
In DepthDetails ArticlePubMed
TargetProto-oncogene tyrosine-protein kinase Src(Homo sapiens (Human))
University Of Washington
Curated by ChEMBL
LigandPNGBDBM50383374(CHEMBL2030555 | CHEMBL2069960 | US10544104, Compou...)
Affinity DataKi: >2.00E+4nM. Assay description: Inhibition of human SRC by radiometric assay
In DepthDetails ArticlePubMed
TargetCalcium-dependent protein kinase 1(Cryptosporidium parvum)
University of Washington Through Its Center For Commercialization
US Patent
LigandPNGBDBM50383374(CHEMBL2030555 | CHEMBL2069960 | US10544104, Compou...)
Affinity DataIC50:  83.7nM. Assay description: Two types of enzyme assays were developed to follow TgCDPK1 activity, a radiometric scintillation proximity assay measured the labeled γ-phospha...
In DepthDetails US Patent
TargetProto-oncogene tyrosine-protein kinase Src(Homo sapiens (Human))
University Of Washington
Curated by ChEMBL
LigandPNGBDBM50383374(CHEMBL2030555 | CHEMBL2069960 | US10544104, Compou...)
Affinity DataIC50: >2.00E+4nM. Assay description: Inhibition of human tyrosine kinases.
In DepthDetails US Patent
TargetCalcium/calmodulin dependent protein kinase with a kinas domain and 4 calmodulin-like EF hands(Cryptosporidium parvum (strain Iowa II))
University of Washington Through Its Center For Commercialization
US Patent
LigandPNGBDBM50383374(CHEMBL2030555 | CHEMBL2069960 | US10544104, Compou...)
Affinity DataIC50:  83.7nM. Assay description: Inhibition of TgCDPK1 and CpCDPK1 was determined using a luminescent kinase assay which measures ATP depletion in the presence of the Syntide 2 pepti...
In DepthDetails US Patent
TargetCalmodulin-domain protein kinase 1(Toxoplasma gondii)
University of Washington Through Its Center For
US Patent
LigandPNGBDBM50383374(CHEMBL2030555 | CHEMBL2069960 | US10544104, Compou...)
Affinity DataIC50:  114nM. Assay description: Inhibition of TgCDPK1 and CpCDPK1 was determined using a luminescent kinase assay which measures ATP depletion in the presence of the Syntide 2 pepti...
In DepthDetails US Patent
TargetCalmodulin-domain protein kinase 1, putative(Cryptosporidium parvum (strain Iowa II))
University of Washington Through Its Center For
US Patent
LigandPNGBDBM50383374(CHEMBL2030555 | CHEMBL2069960 | US10544104, Compou...)
Affinity DataIC50:  83.7nM. Assay description: Inhibition of TgCDPK1 and CpCDPK1 was determined using a luminescent kinase assay which measures ATP depletion in the presence of the Syntide 2 pepti...
In DepthDetails US Patent
TargetProto-oncogene tyrosine-protein kinase Src(Homo sapiens (Human))
University Of Washington
Curated by ChEMBL
LigandPNGBDBM50383374(CHEMBL2030555 | CHEMBL2069960 | US10544104, Compou...)
Affinity DataIC50: >2.00E+4nM. Assay description: Inhibition of TgCDPK1 and CpCDPK1 was determined using a luminescent kinase assay which measures ATP depletion in the presence of the Syntide 2 pepti...
In DepthDetails US Patent
TargetTyrosine-protein kinase ABL1(Homo sapiens (Human))
University Of Washington
Curated by ChEMBL
LigandPNGBDBM50383374(CHEMBL2030555 | CHEMBL2069960 | US10544104, Compou...)
Affinity DataIC50: >2.00E+4nM. Assay description: Inhibition of TgCDPK1 and CpCDPK1 was determined using a luminescent kinase assay which measures ATP depletion in the presence of the Syntide 2 pepti...
In DepthDetails US Patent
TargetcGMP-dependent protein kinase()
University of Washington Through Its Center For Commercialization
US Patent
LigandPNGBDBM50383374(CHEMBL2030555 | CHEMBL2069960 | US10544104, Compou...)
Affinity DataIC50:  114nM. Assay description: Inhibition of TgCDPK1 and CpCDPK1 was determined using a luminescent kinase assay which measures ATP depletion in the presence of the Syntide 2 pepti...
In DepthDetails US Patent
TargetCalmodulin-domain protein kinase 1(Toxoplasma gondii)
University of Washington Through Its Center For
US Patent
LigandPNGBDBM50383374(CHEMBL2030555 | CHEMBL2069960 | US10544104, Compou...)
Affinity DataIC50:  114nM. Assay description: Most known kinase inhibitors bind in the ATP-binding pocket of the active site19,20. These inhibitors exploit many of the same hydrophobic contacts a...
In DepthDetails US Patent
TargetProto-oncogene tyrosine-protein kinase Src(Homo sapiens (Human))
University Of Washington
Curated by ChEMBL
LigandPNGBDBM50383374(CHEMBL2030555 | CHEMBL2069960 | US10544104, Compou...)
Affinity DataIC50: >1.00E+4nM. Assay description: Inhibition of human SRC using Ac-EIYGEFKKK-OH as substrate after 60 mins by phosphorimaging method
In DepthDetails ArticlePubMed
TargetTyrosine-protein kinase ABL1(Homo sapiens (Human))
University Of Washington
Curated by ChEMBL
LigandPNGBDBM50383374(CHEMBL2030555 | CHEMBL2069960 | US10544104, Compou...)
Affinity DataIC50: >2.00E+4nM. Assay description: Inhibition of human tyrosine kinases.
In DepthDetails US Patent