BDBM50386755 CHEMBL2046889
SMILES C(CNCCC(c1ccccc1)c1ccccc1)Cc1ccccc1
InChI Key InChIKey=URZOIXVPUIVTPT-UHFFFAOYSA-N
Data  2 IC50
  Tab Delimited (TSV)   2D SDfile   Computed 3D by Vconf -m prep SDfile
Find this compound or compounds like it in BindingDB:
Activity Spreadsheet -- Enzyme Inhibition Constant Data from BindingDB
Found 2 hits for monomerid = 50386755
TargetPotassium voltage-gated channel subfamily H member 2(Homo sapiens (Human))
University Of Bologna
Curated by ChEMBL
LigandPNGBDBM50386755(CHEMBL2046889)
Affinity DataIC50:  15.8nM. Assay description: Inhibition of human ERG expressed in HEK cells by patch clamp assay
In DepthDetails ArticlePubMed
TargetPotassium voltage-gated channel subfamily H member 2(Homo sapiens (Human))
University Of Bologna
Curated by ChEMBL
LigandPNGBDBM50386755(CHEMBL2046889)
Affinity DataIC50:  17nM. Assay description: Inhibition of human ERG expressed in HEK cells by patch clamp assay
In DepthDetails ArticlePubMed