BDBM50392560 CHEMBL2152812
SMILES CCCCn1cc(C(=O)N[C@@H]2C(C)(C)C3CC[C@]2(C)C3)c(=O)c2ccc(Sc3ccccc3)cc12
InChI Key InChIKey=WYIWVXGKQYHCQT-HZFOSRTRSA-N
Data  2 KI
  Tab Delimited (TSV)   2D SDfile   Computed 3D by Vconf -m prep SDfile
Find this compound or compounds like it in BindingDB:
Activity Spreadsheet -- Enzyme Inhibition Constant Data from BindingDB
Found 2 hits for monomerid = 50392560
TargetCannabinoid receptor 2(Homo sapiens (Human))
Universit£
Curated by ChEMBL
LigandPNGBDBM50392560(CHEMBL2152812)
Affinity DataKi:  0.100nM. Assay description: Displacement of [3H]CP55940 from human recombinant CB2 receptor transfected in HEK cell membranes
In DepthDetails ArticlePubMed
TargetCannabinoid receptor 1(Homo sapiens (Human))
Universit£
Curated by ChEMBL
LigandPNGBDBM50392560(CHEMBL2152812)
Affinity DataKi:  4.70nM. Assay description: Displacement of [3H]CP55940 from human recombinant CB1 receptor transfected in HEK cell membrane
In DepthDetails ArticlePubMed