BDBM50394641 CHEMBL2164585
SMILES Clc1cccc(CN2CCN(CC2)C(=O)Nc2ccccc2)c1
InChI Key InChIKey=CEQJSZWFXBCTSP-UHFFFAOYSA-N
Data  2 IC50
  Tab Delimited (TSV)   2D SDfile   Computed 3D by Vconf -m prep SDfile
Find this compound or compounds like it in BindingDB:
Activity Spreadsheet -- Enzyme Inhibition Constant Data from BindingDB
Found 2 hits for monomerid = 50394641
TargetFatty-acid amide hydrolase 1(Homo sapiens (Human))
TBA
Curated by ChEMBL
LigandPNGBDBM50394641(CHEMBL2164585)
Affinity DataIC50:  840nM. Assay description: Inhibition of human FAAH after 1 hr
In DepthDetails ArticlePubMed
TargetFatty-acid amide hydrolase 1 [30-579](Rattus norvegicus (rat))
TBA
Curated by ChEMBL
LigandPNGBDBM50394641(CHEMBL2164585)
Affinity DataIC50:  5.60E+3nM. Assay description: Inhibition of rat FAAH after 1 hr
In DepthDetails ArticlePubMed