BDBM50395124 CHEMBL2163569
SMILES COP(=O)(OC)O[C@@H]1CCC[C@H]1Nc1nc(Cl)nc2n(cnc12)[C@@H]1O[C@H](CO)[C@@H](O)[C@H]1O
InChI Key InChIKey=FDUIENWUDICKHK-XULTWRPTSA-N
Data  1 EC50
  Tab Delimited (TSV)   2D SDfile   Computed 3D by Vconf -m prep SDfile
Find this compound or compounds like it in BindingDB:
Activity Spreadsheet -- Enzyme Inhibition Constant Data from BindingDB
Found 1 hit for monomerid = 50395124
TargetAdenosine receptor A1(Homo sapiens (Human))
University Of North Carolina At Chapel Hill
Curated by ChEMBL
LigandPNGBDBM50395124(CHEMBL2163569)
Affinity DataEC50: >1.00E+4nM. Assay description: Agonist activity at human A1AR expressed in HEK293T/17 cells assessed as inhibition of forskolin-induced cAMP accumulation incubated for 10 mins by l...
In DepthDetails ArticlePubMed