BDBM50397271 CHEMBL2169933
SMILES COc1cccc(c1)-c1cccc(c1)[C@@H]1C[C@@H]1c1cc(=O)n(C)c(N)n1
InChI Key InChIKey=QECXNBWGUGUPSI-ROUUACIJSA-N
Data  1 IC50
PDB links: 1 PDB ID matches this monomer.
  Tab Delimited (TSV)   2D SDfile   Computed 3D by Vconf -m prep SDfile
Find this compound or compounds like it in BindingDB:
Activity Spreadsheet -- Enzyme Inhibition Constant Data from BindingDB
Found 1 hit for monomerid = 50397271
TargetBeta-secretase 1(Homo sapiens (Human))
Shionogi
Curated by ChEMBL
LigandPNGBDBM50397271(CHEMBL2169933)
Affinity DataIC50:  4.60E+3nM. Assay description: Inhibition of human BACE1 (43-454 amino acids) expressed in Escherichia coli BL21 using SEVNLDAEFRHDSGYEK-biotinafter 3 hrs by ELISA