BDBM50399447 CHEMBL2179381
SMILES CN1Cc2cc(Br)ccc2NC1=O
InChI Key InChIKey=FZPAKYJRNKYQBY-UHFFFAOYSA-N
Data  1 IC50
PDB links: 2 PDB IDs match this monomer.
  Tab Delimited (TSV)   2D SDfile   Computed 3D by Vconf -m prep SDfile
Find this compound or compounds like it in BindingDB:
Activity Spreadsheet -- Enzyme Inhibition Constant Data from BindingDB
Found 1 hit for monomerid = 50399447
TargetBromodomain-containing protein 4(Homo sapiens (Human))
Pfizer
Curated by ChEMBL
LigandPNGBDBM50399447(CHEMBL2179381)
Affinity DataIC50:  2.30E+4nM. Assay description: Inhibition of BRD4 isoform 1 by AlphaScreen assay