BDBM50400826 CHEMBL2205026
SMILES Brc1ccc(cc1)S1=NS(=O)(=O)c2cc(ccc12)C#N
InChI Key InChIKey=ZXFJKUJFFQDHCO-UHFFFAOYSA-N
Data  2 IC50
  Tab Delimited (TSV)   2D SDfile   Computed 3D by Vconf -m prep SDfile
Find this compound or compounds like it in BindingDB:
Activity Spreadsheet -- Enzyme Inhibition Constant Data from BindingDB
Found 2 hits for monomerid = 50400826
TargetEpidermal growth factor receptor(Homo sapiens (Human))
Bristol-Myers Squibb Pharmaceutical Research And Development
Curated by ChEMBL
LigandPNGBDBM50400826(CHEMBL2205026)
Affinity DataIC50: >4.00E+4nM. Assay description: Inhibition of HER1
In DepthDetails ArticlePubMed
TargetReceptor tyrosine-protein kinase erbB-2(Homo sapiens (Human))
Bristol-Myers Squibb Pharmaceutical Research And Development
Curated by ChEMBL
LigandPNGBDBM50400826(CHEMBL2205026)
Affinity DataIC50:  3.00E+3nM. Assay description: Inhibition of HER2
In DepthDetails ArticlePubMed