BDBM50403774 CHEMBL273982
SMILES COc1ccccc1N1CCN(CCCCCN2C(=O)c3cccc4cccc2c34)CC1
InChI Key InChIKey=YNNABVPDZUANMA-UHFFFAOYSA-N
Data  2 KI
  Tab Delimited (TSV)   2D SDfile   Computed 3D by Vconf -m prep SDfile
Find this compound or compounds like it in BindingDB:
Activity Spreadsheet -- Enzyme Inhibition Constant Data from BindingDB
Found 2 hits for monomerid = 50403774
Target5-hydroxytryptamine receptor 7(Rattus norvegicus (rat))
Universidad Complutense
Curated by ChEMBL
LigandPNGBDBM50403774(CHEMBL273982)
Affinity DataKi:  100nM. Assay description: Binding affinity towards 5-hydroxytryptamine receptor 7 on rat hypothalamus membranes using [3H]5-CT as radioligand.
In DepthDetails ArticlePubMed
Target5-hydroxytryptamine receptor 7(Rattus norvegicus (rat))
Universidad Complutense
Curated by ChEMBL
LigandPNGBDBM50403774(CHEMBL273982)
Affinity DataKi:  100nM. Assay description: Binding affinity against 5-hydroxytryptamine 7 receptor using [3H]-5-CT in rat hypothalamus membranes
In DepthDetails ArticlePubMed