BDBM50406763 CHEMBL39801
SMILES CN(C)CCc1c[nH]c2ccc(Cc3nc(Cc4ccc(NS(C)(=O)=O)cc4)no3)cc12
InChI Key InChIKey=RLRTXTNPUBQHCW-UHFFFAOYSA-N
Data  1 IC50
  Tab Delimited (TSV)   2D SDfile   Computed 3D by Vconf -m prep SDfile
Find this compound or compounds like it in BindingDB:
Activity Spreadsheet -- Enzyme Inhibition Constant Data from BindingDB
Found 1 hit for monomerid = 50406763
Target5-hydroxytryptamine receptor 1D(Sus scrofa)
Merck Sharp And Dohme Research Laboratories
Curated by ChEMBL
LigandPNGBDBM50406763(CHEMBL39801)
Affinity DataIC50:  32nM. Assay description: Displacement of radioligand [3H]5-HT binding to 5-hydroxytryptamine 1D receptor in pig caudate membrane
In DepthDetails ArticlePubMed