BDBM50407166 CHEMBL48085
SMILES Oc1cc(O)c2nc(sc2c1)-c1ccc(O)c(O)c1
InChI Key InChIKey=XWVVZTQPCQUBSZ-UHFFFAOYSA-N
Data  1 IC50
  Tab Delimited (TSV)   2D SDfile   Computed 3D by Vconf -m prep SDfile
Find this compound or compounds like it in BindingDB:
Activity Spreadsheet -- Enzyme Inhibition Constant Data from BindingDB
Found 1 hit for monomerid = 50407166
TargetEpidermal growth factor receptor(Homo sapiens (Human))
University Of Nottingham
Curated by ChEMBL
LigandPNGBDBM50407166(CHEMBL48085)
Affinity DataIC50:  1.30E+5nM. Assay description: Cytotoxic effect on EGF-receptor overexpressing HN5 squamous carcinoma cells
In DepthDetails ArticlePubMed