BDBM50411391 CHEMBL242603
SMILES CC(CCSc1nnc(-c2cccc3nc(C)ccc23)n1C)N1CCc2ccc(cc2CC1)-c1cc(C)nn1C
InChI Key InChIKey=BZIIORPIORBBJU-UHFFFAOYSA-N
Data  1 IC50
  Tab Delimited (TSV)   2D SDfile   Computed 3D by Vconf -m prep SDfile
Find this compound or compounds like it in BindingDB:
Activity Spreadsheet -- Enzyme Inhibition Constant Data from BindingDB
Found 1 hit for monomerid = 50411391
TargetPotassium voltage-gated channel subfamily H member 2(Homo sapiens (Human))
Glaxosmithkline
Curated by ChEMBL
LigandPNGBDBM50411391(CHEMBL242603)
Affinity DataIC50:  1.26E+3nM. Assay description: Displacement of [3H]dofetilide from hERG expressed in CHO cells
In DepthDetails ArticlePubMed