BDBM50423538 CHEMBL259313
SMILES C[C@]1(O)CC[C@H]2[C@@H]3CCC4=CC(=O)C(C)(C)CC4=C3C=C[C@]12C
InChI Key InChIKey=VFKZTCQVCJGPGF-GWKIZSTFSA-N
Data  1 Kd
  Tab Delimited (TSV)   2D SDfile   Computed 3D by Vconf -m prep SDfile
Find this compound or compounds like it in BindingDB:
Activity Spreadsheet -- Enzyme Inhibition Constant Data from BindingDB
Found 1 hit for monomerid = 50423538
TargetSex hormone-binding globulin(Homo sapiens (Human))
University Of British Columbia
Curated by ChEMBL
LigandPNGBDBM50423538(CHEMBL259313)
Affinity DataKd:  138nM. Assay description: Displacement of [3H]5alpha dihydrotestosterone from human sex hormone binding globulin
In DepthDetails ArticlePubMed