BDBM50425554 CHEMBL2313654
SMILES Cc1cc(C)c(c(C)c1)S(=O)(=O)c1cc(C)c(C)cc1C
InChI Key InChIKey=QXJITWIQGAXQPU-UHFFFAOYSA-N
Data  1 IC50
  Tab Delimited (TSV)   2D SDfile   Computed 3D by Vconf -m prep SDfile
Find this compound or compounds like it in BindingDB:
Activity Spreadsheet -- Enzyme Inhibition Constant Data from BindingDB
Found 1 hit for monomerid = 50425554
TargetRap guanine nucleotide exchange factor 4(Homo sapiens (Human))
University Of Texas Medical Branch
Curated by ChEMBL
LigandPNGBDBM50425554(CHEMBL2313654)
Affinity DataIC50:  700nM. Assay description: Antagonist activity at recombinant EPAC2 (unknown origin) assessed 8-NBD-cAMP substrate fluorescence intensity by substrate competing assay
In DepthDetails ArticlePubMed