BDBM50427220 OXINIACIC ACID
SMILES OC(=O)c1ccc[n+]([O-])c1
InChI Key InChIKey=FJCFFCXMEXZEIM-UHFFFAOYSA-N
Data  1 IC50
  Tab Delimited (TSV)   2D SDfile   Computed 3D by Vconf -m prep SDfile
Find this compound or compounds like it in BindingDB:
Activity Spreadsheet -- Enzyme Inhibition Constant Data from BindingDB
Found 1 hit for monomerid = 50427220
TargetD-amino-acid oxidase(Homo sapiens (Human))
Kitasato University
Curated by ChEMBL
LigandPNGBDBM50427220(OXINIACIC ACID)
Affinity DataIC50: >2.50E+6nM. Assay description: Inhibition of human recombinant N-terminal His-tagged DAO expressed in Escherichia coli BL21(DE3) using D-serine as substrate by colorimetric assay
In DepthDetails ArticlePubMed