BDBM50429347 CHEMBL2334902
SMILES CS(=O)(=O)c1ccc(cc1)C(=C/c1ccc(F)cc1)\C(O)=O
InChI Key InChIKey=GMFKLSJNQDPTHI-XNTDXEJSSA-N
Data  1 IC50
  Tab Delimited (TSV)   2D SDfile   Computed 3D by Vconf -m prep SDfile
Find this compound or compounds like it in BindingDB:
Activity Spreadsheet -- Enzyme Inhibition Constant Data from BindingDB
Found 1 hit for monomerid = 50429347
TargetAldo-keto reductase family 1 member C3(Homo sapiens (Human))
University Of Ljubljana
Curated by ChEMBL
LigandPNGBDBM50429347(CHEMBL2334902)
Affinity DataIC50:  4.31E+4nM. Assay description: Inhibition of recombinant AKR1C3 (unknown origin) assessed as decrease in oxidation of 1-acenaphthenol substrate by spectrophotometric analysis
In DepthDetails ArticlePubMed