BDBM50429750 CAFFEIC ACID PHENETHYL AMIDE
SMILES Oc1ccc(\C=C\C(=O)NCCc2ccccc2)cc1O
InChI Key InChIKey=QOWABIXYAFJMQE-VQHVLOKHSA-N
Data  3 IC50
  Tab Delimited (TSV)   2D SDfile   Computed 3D by Vconf -m prep SDfile
Find this compound or compounds like it in BindingDB:
Activity Spreadsheet -- Enzyme Inhibition Constant Data from BindingDB
Found 3 hits for monomerid = 50429750
TargetMatrix metalloproteinase-9(Homo sapiens (Human))
Nanjing University Of Chinese Medicine
Curated by ChEMBL
LigandPNGBDBM50429750(CAFFEIC ACID PHENETHYL AMIDE)
Affinity DataIC50:  7.30nM. Assay description: Inhibition of human recombinant MMP9 using succinylated gelatin as substrate incubated for 30 mins prior to substrate addition measured after 60 mins
In DepthDetails ArticlePubMed
TargetInterstitial collagenase(Homo sapiens (Human))
Nanjing University Of Chinese Medicine
Curated by ChEMBL
LigandPNGBDBM50429750(CAFFEIC ACID PHENETHYL AMIDE)
Affinity DataIC50:  3.30E+3nM. Assay description: Inhibition of human recombinant MMP1 using succinylated gelatin as substrate incubated for 30 mins prior to substrate addition measured after 60 mins
In DepthDetails ArticlePubMed
Target72 kDa type IV collagenase(Homo sapiens (Human))
Nanjing University Of Chinese Medicine
Curated by ChEMBL
LigandPNGBDBM50429750(CAFFEIC ACID PHENETHYL AMIDE)
Affinity DataIC50:  8.20nM. Assay description: Inhibition of human recombinant MMP2 using succinylated gelatin as substrate incubated for 30 mins prior to substrate addition measured after 60 mins
In DepthDetails ArticlePubMed