BDBM50435876 CHEMBL2391074
SMILES Clc1ccc(cc1)S(=O)(=O)N1CCC(Cc2ccccc2)CC1
InChI Key InChIKey=FDOUWHOQTJKHEX-UHFFFAOYSA-N
Data  1 KI
  Tab Delimited (TSV)   2D SDfile   Computed 3D by Vconf -m prep SDfile
Find this compound or compounds like it in BindingDB:
Activity Spreadsheet -- Enzyme Inhibition Constant Data from BindingDB
Found 1 hit for monomerid = 50435876
TargetSigma non-opioid intracellular receptor 1(Cavia porcellus (Guinea pig))
Nstri
Curated by ChEMBL
LigandPNGBDBM50435876(CHEMBL2391074)
Affinity DataKi:  551nM. Assay description: Displacement of [3H](+)pentazocine from sigma1 receptor in Dunkin Hartley guinea pig brain membrane after 120 mins by liquid scintillation counting a...
In DepthDetails ArticlePubMed