BDBM50439263 1-NITROSOCYCLOHEXYL ACETATE
SMILES CC(=O)OC1(CCCCC1)N=O
InChI Key InChIKey=GOPUAEYNVWXBPR-UHFFFAOYSA-N
Data  1 IC50
  Tab Delimited (TSV)   2D SDfile   Computed 3D by Vconf -m prep SDfile
Find this compound or compounds like it in BindingDB:
Activity Spreadsheet -- Enzyme Inhibition Constant Data from BindingDB
Found 1 hit for monomerid = 50439263
TargetGlyceraldehyde-3-phosphate dehydrogenase(Oryctolagus cuniculus)
Wake Forest University
Curated by ChEMBL
LigandPNGBDBM50439263(1-NITROSOCYCLOHEXYL ACETATE)
Affinity DataIC50:  200nM. Assay description: Inhibition of rabbit muscle GAPDH assessed as residual enzyme activity after 60 mins by spectrophotometry
In DepthDetails ArticlePubMed