BDBM50441304 CHEMBL2431686
SMILES OP(O)(=O)C(F)(F)c1ccc(cc1)-c1cccc(Cc2ccc(Cl)c(Cl)c2)c1
InChI Key InChIKey=KXVOBXHNLGTNSF-UHFFFAOYSA-N
Data  2 KI
  Tab Delimited (TSV)   2D SDfile   Computed 3D by Vconf -m prep SDfile
Find this compound or compounds like it in BindingDB:
Activity Spreadsheet -- Enzyme Inhibition Constant Data from BindingDB
Found 2 hits for monomerid = 50441304
TargetTyrosine-protein phosphatase non-receptor type 5(Homo sapiens (Human))
Yale University
Curated by ChEMBL
LigandPNGBDBM50441304(CHEMBL2431686)
Affinity DataKi:  9.60E+3nM. Assay description: Inhibition of STEP (unknown origin) using pNPP as substrate preincubated for 5 mins followed by substrate addition measured for 20 mins by spectropho...
In DepthDetails ArticlePubMed
TargetTyrosine-protein phosphatase non-receptor type 5(Homo sapiens (Human))
Yale University
Curated by ChEMBL
LigandPNGBDBM50441304(CHEMBL2431686)
Affinity DataKi:  9.60E+3nM. Assay description: Inhibition of human STEP using pNPP as substrate after 5 mins by spectrophotometric plate reader analysis
In DepthDetails ArticlePubMed