BDBM50442911 RETINYL ACETATE
SMILES CC(=O)OC\C=C(/C)\C=C\C=C(/C)\C=C\C1=C(C)CCCC1(C)C
InChI Key InChIKey=QGNJRVVDBSJHIZ-QHLGVNSISA-N
Data  2 KI  2 IC50
  Tab Delimited (TSV)   2D SDfile   Computed 3D by Vconf -m prep SDfile
Find this compound or compounds like it in BindingDB:
Activity Spreadsheet -- Enzyme Inhibition Constant Data from BindingDB
Found 4 hits for monomerid = 50442911
TargetSolute carrier organic anion transporter family member 1B1(Homo sapiens (Human))
Ku Leuven
Curated by ChEMBL
LigandPNGBDBM50442911(RETINYL ACETATE)
Affinity DataKi:  1.22E+3nM. Assay description: Ki values for sodium fluorescein (10 uM) uptake in OATP1B1-transfected CHO cells
In DepthDetails ArticlePubMed
TargetSolute carrier organic anion transporter family member 1B3(Homo sapiens (Human))
Ku Leuven
Curated by ChEMBL
LigandPNGBDBM50442911(RETINYL ACETATE)
Affinity DataKi:  3.89E+3nM. Assay description: Ki values for sodium fluorescein (10 uM) uptake in OATP1B3-transfected CHO cells
In DepthDetails ArticlePubMed
TargetSolute carrier organic anion transporter family member 1B1(Homo sapiens (Human))
Ku Leuven
Curated by ChEMBL
LigandPNGBDBM50442911(RETINYL ACETATE)
Affinity DataIC50:  2.24E+3nM. Assay description: pIC50 values for sodium fluorescein (10 uM) uptake in OATP1B1-transfected CHO cells
In DepthDetails ArticlePubMed
TargetSolute carrier organic anion transporter family member 1B3(Homo sapiens (Human))
Ku Leuven
Curated by ChEMBL
LigandPNGBDBM50442911(RETINYL ACETATE)
Affinity DataIC50:  5.01E+3nM. Assay description: pIC50 values for sodium fluorescein (10 uM) uptake in OATP1B3-transfected CHO cells
In DepthDetails ArticlePubMed