BDBM50443042 CHEMBL3087814
SMILES CCN(CC)CCNS(=O)(=O)c1cccc(OC)c1
InChI Key InChIKey=UWYTYLDQZQFXBP-UHFFFAOYSA-N
Data  1 IC50
PDB links: 1 PDB ID matches this monomer.
  Tab Delimited (TSV)   2D SDfile   Computed 3D by Vconf -m prep SDfile
Find this compound or compounds like it in BindingDB:
Activity Spreadsheet -- Enzyme Inhibition Constant Data from BindingDB
Found 1 hit for monomerid = 50443042
TargetAcetylcholinesterase(Mus musculus (mouse))
Ume£
Curated by ChEMBL
LigandPNGBDBM50443042(CHEMBL3087814)
Affinity DataIC50:  7.00E+3nM. Assay description: Inhibition of mouse recombinant AChE using acetylthiocholine iodide as substrate by Ellman's method