BDBM50450507 CHEMBL4175922
SMILES O[C@@H]1CN(C[C@H]1COc1ccc(C#N)c(F)c1)S(=O)(=O)c1ccc(Cl)cc1Cl
InChI Key InChIKey=BXJNNQDYLWMHBF-YVEFUNNKSA-N
Data  1 IC50
  Tab Delimited (TSV)   2D SDfile   Computed 3D by Vconf -m prep SDfile
Find this compound or compounds like it in BindingDB:
Activity Spreadsheet -- Enzyme Inhibition Constant Data from BindingDB
Found 1 hit for monomerid = 50450507
LigandPNGBDBM50450507(CHEMBL4175922)
Affinity DataIC50:  1.00E+3nM. Assay description: Antagonist activity at human TRPV4 expressed in BHK/AC9 or HEK MSR2 cells assessed as inhibition of PF-04674114-induced Ca2+ flux pre-incubated for 1...
Ligand InfoPC cidPC sid
In DepthDetails ArticlePubMed