BDBM50453613 Alpha-Cyclopiazonic Acid::CHEBI:22450::Cyclopiazonic Acid
SMILES [H][C@@]12Cc3cccc4[nH]cc(c34)[C@]1([H])[C@]1([H])N(C(=O)C(C(C)=O)=C1O)C2(C)C
InChI Key InChIKey=SZINUGQCTHLQAZ-DQYPLSBCSA-N
Data  1 KI
  Tab Delimited (TSV)   2D SDfile   Computed 3D by Vconf -m prep SDfile
Find this compound or compounds like it in BindingDB:
Activity Spreadsheet -- Enzyme Inhibition Constant Data from BindingDB
Found 1 hit for monomerid = 50453613
LigandPNGBDBM50453613(Alpha-Cyclopiazonic Acid | CHEBI:22450 | Cyclopiaz...)
Affinity DataKi:  1.80E+3nM. Assay description: Inhibition of SERCA1a (unknown origin) ATPase activity
In DepthDetails ArticlePubMed