BDBM50454090 CHEMBL19491
SMILES Fc1ccc(cc1)C(=O)C1CCN(CCc2ccccc2)CC1
InChI Key InChIKey=IRZABLOJOJACMJ-UHFFFAOYSA-N
Data  4 KI
  Tab Delimited (TSV)   2D SDfile   Computed 3D by Vconf -m prep SDfile
Find this compound or compounds like it in BindingDB:
Activity Spreadsheet -- Enzyme Inhibition Constant Data from BindingDB
Found 4 hits for monomerid = 50454090
Target5-hydroxytryptamine receptor 2A(Rattus norvegicus (rat))
Virginia Commonwealth University
Curated by ChEMBL
LigandPNGBDBM50454090(CHEMBL19491)
Affinity DataKi:  8.5nM. Assay description: Binding affinity against 5-hydroxytryptamine 2A receptor
In DepthDetails ArticlePubMed
TargetSerotonin 2 (5-HT2) receptor(RAT)
Virginia Commonwealth University
Curated by ChEMBL
LigandPNGBDBM50454090(CHEMBL19491)
Affinity DataKi:  8.5nM. Assay description: Binding affinity against 5-hydroxytryptamine 2 receptor in rat using [3H]ketanserin as radioligand
In DepthDetails ArticlePubMed
Target5-hydroxytryptamine receptor 2C(Rattus norvegicus (Rat))
Virginia Commonwealth University
Curated by ChEMBL
LigandPNGBDBM50454090(CHEMBL19491)
Affinity DataKi:  145nM. Assay description: Binding affinity against 5-hydroxytryptamine 1C receptor in rat using [3H]mesulergine as radioligand
In DepthDetails ArticlePubMed
Target5-hydroxytryptamine receptor 2C(Rattus norvegicus (Rat))
Virginia Commonwealth University
Curated by ChEMBL
LigandPNGBDBM50454090(CHEMBL19491)
Affinity DataKi:  145nM. Assay description: Binding affinity against 5-hydroxytryptamine 2C receptor
In DepthDetails ArticlePubMed