BDBM50462455 CHEMBL3250749
SMILES Nc1nc(Cl)nc2n(cnc12)[C@@H]1O[C@H](COS(N)(=O)=O)[C@@H](O)[C@H]1O
InChI Key InChIKey=JHUGCRSKMUFKHR-UUOKFMHZSA-N
Data  4 KI
PDB links: 1 PDB ID matches this monomer.
  Tab Delimited (TSV)   2D SDfile   Computed 3D by Vconf -m prep SDfile
Find this compound or compounds like it in BindingDB:
Activity Spreadsheet -- Enzyme Inhibition Constant Data from BindingDB
Found 4 hits for monomerid = 50462455
TargetCarbonic anhydrase 2(Homo sapiens (Human))
Griffith University
Curated by ChEMBL
LigandPNGBDBM50462455(CHEMBL3250749)
Affinity DataKi:  65nM. Assay description: Inhibition of recombinant human CA2 expressed in Escherichia coli assessed as reduction in CO2 hydration by stopped flow assay
TargetCarbonic anhydrase 9(Homo sapiens (Human))
Griffith University
Curated by ChEMBL
LigandPNGBDBM50462455(CHEMBL3250749)
Affinity DataKi:  143nM. Assay description: Inhibition of recombinant human CA9 expressed in Escherichia coli assessed as reduction in CO2 hydration by stopped flow assay
In DepthDetails ArticlePubMed
TargetCarbonic anhydrase 1(Homo sapiens (Human))
Griffith University
Curated by ChEMBL
LigandPNGBDBM50462455(CHEMBL3250749)
Affinity DataKi:  167nM. Assay description: Inhibition of recombinant human CA1 expressed in Escherichia coli assessed as reduction in CO2 hydration by stopped flow assay
In DepthDetails ArticlePubMed
TargetCarbonic anhydrase 4(Homo sapiens (Human))
Griffith University
Curated by ChEMBL
LigandPNGBDBM50462455(CHEMBL3250749)
Affinity DataKi:  234nM. Assay description: Inhibition of recombinant human CA4 expressed in Escherichia coli assessed as reduction in CO2 hydration by stopped flow assay
In DepthDetails ArticlePubMed