BDBM50476735 Addyi::BIMT-17::BIMT-17-BS::Flibanserin
SMILES FC(F)(F)c1cccc(c1)N1CCN(CCn2c3ccccc3[nH]c2=O)CC1
InChI Key InChIKey=PPRRDFIXUUSXRA-UHFFFAOYSA-N
Data  2 KI  1 EC50
  Tab Delimited (TSV)   2D SDfile   Computed 3D by Vconf -m prep SDfile
Find this compound or compounds like it in BindingDB:
Activity Spreadsheet -- Enzyme Inhibition Constant Data from BindingDB
Found 3 hits for monomerid = 50476735
Target5-hydroxytryptamine receptor 1A(Rattus norvegicus (rat))
Pierre Fabre Research Center
Curated by ChEMBL
LigandPNGBDBM50476735(Addyi | BIMT-17 | BIMT-17-BS | Flibanserin)
Affinity DataKi:  12nM. Assay description: Binding affinity to 5HT1A receptor in rat cortex membrane
In DepthDetails ArticlePubMed
Target5-hydroxytryptamine receptor 1A(Homo sapiens (Human))
Cracow University Of Technology
Curated by ChEMBL
LigandPNGBDBM50476735(Addyi | BIMT-17 | BIMT-17-BS | Flibanserin)
Affinity DataKi:  12nM. Assay description: Displacement of [3H]-5-OH-DPAT from human 5-HT1AR in human brain tissue by radioligand binding assay
In DepthDetails PubMed
Target5-hydroxytryptamine receptor 1A(Homo sapiens (Human))
Cracow University Of Technology
Curated by ChEMBL
LigandPNGBDBM50476735(Addyi | BIMT-17 | BIMT-17-BS | Flibanserin)
Affinity DataEC50:  631nM. Assay description: Agonist activity at human 5HT1A receptor expressed in C6 cells assessed as stimulation of [35S]GTPgammaS binding
In DepthDetails ArticlePubMed