BDBM50478424 Vulpinic Acid
SMILES COC(=O)C(=C1\OC(=O)C(=C1O)c1ccccc1)\c1ccccc1
InChI Key InChIKey=OMZRMXULWNMRAE-BMRADRMJSA-N
Data  2 IC50
  Tab Delimited (TSV)   2D SDfile   Computed 3D by Vconf -m prep SDfile
Find this compound or compounds like it in BindingDB:
Activity Spreadsheet -- Enzyme Inhibition Constant Data from BindingDB
Found 2 hits for monomerid = 50478424
TargetProstaglandin G/H synthase 1(Homo sapiens (Human))
The University Of Mississippi
Curated by ChEMBL
LigandPNGBDBM50478424(Vulpinic Acid)
Affinity DataIC50:  6.76E+5nM. Assay description: Inhibition of COX1
In DepthDetails ArticlePubMed
TargetEnoyl-[acyl-carrier-protein] reductase [NADH] FabI(Escherichia coli)
University Of London
Curated by ChEMBL
LigandPNGBDBM50478424(Vulpinic Acid)
Affinity DataIC50:  8.40E+4nM. Assay description: Inhibition of Escherichia coli FabI using 2-dodecenoyl-CoA as substrate at pH 8
In DepthDetails ArticlePubMed