BDBM50478512 1Beta-Hydroxymaprounic Acid::CHEMBL512314
SMILES [H][C@@]12CC[C@@]3(C)C4=CC[C@]5(CCC(C)(C)C[C@@]5([H])[C@]4(C)CC[C@]3([H])[C@@]1(C)[C@H](O)C[C@H](O)C2(C)C)C(O)=O
InChI Key InChIKey=ODPNDPZKFUBRFF-QATJIBKASA-N
Data  1 IC50
  Tab Delimited (TSV)   2D SDfile   Computed 3D by Vconf -m prep SDfile
Find this compound or compounds like it in BindingDB:
Activity Spreadsheet -- Enzyme Inhibition Constant Data from BindingDB
Found 1 hit for monomerid = 50478512
TargetReverse transcriptase(Human immunodeficiency virus 1)
University Of Illinois At Chicago
Curated by ChEMBL
LigandPNGBDBM50478512(1Beta-Hydroxymaprounic Acid | CHEMBL512314)
Affinity DataIC50:  4.90E+3nM. Assay description: Inhibition of HIV1 reverse transcriptase
Ligand InfoPC cidPC sid
In DepthDetails ArticlePubMed