BDBM50478513 2Alpha-Hydroxymaprounic Acid::CHEMBL469925
SMILES [H][C@@]12CC[C@@]3(C)C4=CC[C@]5(CCC(C)(C)C[C@@]5([H])[C@]4(C)CC[C@]3([H])[C@@]1(C)C[C@@H](O)[C@H](O)C2(C)C)C(O)=O
InChI Key InChIKey=JMJVYEINATYJHM-KLXPJGLFSA-N
Data  1 IC50
  Tab Delimited (TSV)   2D SDfile   Computed 3D by Vconf -m prep SDfile
Find this compound or compounds like it in BindingDB:
Activity Spreadsheet -- Enzyme Inhibition Constant Data from BindingDB
Found 1 hit for monomerid = 50478513
TargetReverse transcriptase(Human immunodeficiency virus 1)
University Of Illinois At Chicago
Curated by ChEMBL
LigandPNGBDBM50478513(2Alpha-Hydroxymaprounic Acid | CHEMBL469925)
Affinity DataIC50:  3.40E+3nM. Assay description: Inhibition of HIV1 reverse transcriptase
In DepthDetails ArticlePubMed