BDBM50479144 3-Methylbenzyl Benzoate::CHEMBL453990
SMILES Cc1cccc(COC(=O)c2ccccc2)c1
InChI Key InChIKey=PNDUDVIQWFVXIO-UHFFFAOYSA-N
Data  1 IC50
  Tab Delimited (TSV)   2D SDfile   Computed 3D by Vconf -m prep SDfile
Find this compound or compounds like it in BindingDB:
Activity Spreadsheet -- Enzyme Inhibition Constant Data from BindingDB
Found 1 hit for monomerid = 50479144
TargetType-1 angiotensin II receptor A(Mus musculus)
Nagoya University
Curated by ChEMBL
LigandPNGBDBM50479144(3-Methylbenzyl Benzoate | CHEMBL453990)
Affinity DataIC50:  4.86E+4nM. Assay description: Antagonist activity at HA-tagged mouse AT1a angiotensin 2 receptor expressed in HEK293T cells assessed as decrease in angiotensin 2-induced intracell...
Ligand InfoPC cidPC sid
In DepthDetails ArticlePubMed