BDBM50479165 2-Ethylbenzyl Benzoate::CHEMBL498649
SMILES CCc1ccccc1COC(=O)c1ccccc1
InChI Key InChIKey=PRJCDGZQJQVLKY-UHFFFAOYSA-N
Data  1 IC50
  Tab Delimited (TSV)   2D SDfile   Computed 3D by Vconf -m prep SDfile
Find this compound or compounds like it in BindingDB:
Activity Spreadsheet -- Enzyme Inhibition Constant Data from BindingDB
Found 1 hit for monomerid = 50479165
TargetType-1 angiotensin II receptor A(Mus musculus)
Nagoya University
Curated by ChEMBL
LigandPNGBDBM50479165(2-Ethylbenzyl Benzoate | CHEMBL498649)
Affinity DataIC50:  2.33E+5nM. Assay description: Antagonist activity at HA-tagged mouse AT1a angiotensin 2 receptor expressed in HEK293T cells assessed as decrease in angiotensin 2-induced intracell...
Ligand InfoPC cidPC sid
In DepthDetails ArticlePubMed