BDBM50480894 CHEMBL574571
SMILES OC(=O)c1cc2ccn(Cc3c(F)cc(Cl)cc3F)c2cn1
InChI Key InChIKey=YMCWOVNTEGWFNM-UHFFFAOYSA-N
Data  1 IC50
  Tab Delimited (TSV)   2D SDfile   Computed 3D by Vconf -m prep SDfile
Find this compound or compounds like it in BindingDB:
Activity Spreadsheet -- Enzyme Inhibition Constant Data from BindingDB
Found 1 hit for monomerid = 50480894
TargetIntegrase(Human immunodeficiency virus 1)
Pfizer
Curated by ChEMBL
LigandPNGBDBM50480894(CHEMBL574571)
Affinity DataIC50:  1.19E+3nM. Assay description: Inhibition of HIV1 integrase expressed in Escherichia coli assessed as strand transfer activity by scintillation proximity assay
Ligand InfoPC cidPC sid
In DepthDetails ArticlePubMed