BDBM50482554 CHEMBL1221460::Epihippuristanol 3-Acetate
SMILES [H][C@]12C[C@@]3([H])[C@]4([H])CC[C@@]5([H])C[C@@H](CC[C@]5(C)[C@@]4([H])[C@@H](O)C[C@]3(C)[C@@]1([H])[C@@](C)(O)[C@@]1(C[C@H](C)C(C)(C)O1)O2)OC(C)=O
InChI Key InChIKey=NMENKWADYNCEKW-CAYRAOEMSA-N
Data  1 IC50
  Tab Delimited (TSV)   2D SDfile   Computed 3D by Vconf -m prep SDfile
Find this compound or compounds like it in BindingDB:
Activity Spreadsheet -- Enzyme Inhibition Constant Data from BindingDB
Found 1 hit for monomerid = 50482554
TargetEukaryotic initiation factor 4A-I(Homo sapiens (Human))
Mcgill University
Curated by ChEMBL
LigandPNGBDBM50482554(CHEMBL1221460 | Epihippuristanol 3-Acetate)
Affinity DataIC50: >1.00E+5nM. Assay description: Inhibition of eIF4A-mediated cap-dependent protein synthesis in FF-HCV-Ren mRNA transfected Swiss mouse Krebs2 cell extract by [35S]methionine metabo...
Ligand InfoPC cidPC sid
In DepthDetails ArticlePubMed