BDBM50485292 CHEMBL2047559::Cis-Cyclobutyl Adenosine Phosphonyl Disphosphate
SMILES Nc1ncnc2n(cnc12)[C@@H]1C[C@@H](C1)OCP(O)(=O)OP(O)(=O)OP(O)(O)=O
InChI Key InChIKey=SEMJGGXZKVZFDU-KNVOCYPGSA-N
Data  2 Kd
  Tab Delimited (TSV)   2D SDfile   Computed 3D by Vconf -m prep SDfile
Find this compound or compounds like it in BindingDB:
Activity Spreadsheet -- Enzyme Inhibition Constant Data from BindingDB
Found 2 hits for monomerid = 50485292
TargetReverse transcriptase(Human immunodeficiency virus 1)
Yale University
Curated by ChEMBL
LigandPNGBDBM50485292(CHEMBL2047559 | Cis-Cyclobutyl Adenosine Phosphony...)
Affinity DataKd:  6.50E+3nM. Assay description: Binding affinity to wild type HIV1 reverse transcriptase by pre-steady state kinetics study
Ligand InfoKEGGPC cidPC sid
In DepthDetails ArticlePubMed
TargetReverse transcriptase protein(Human immunodeficiency virus 1)
Yale University
Curated by ChEMBL
LigandPNGBDBM50485292(CHEMBL2047559 | Cis-Cyclobutyl Adenosine Phosphony...)
Affinity DataKd:  4.70E+3nM. Assay description: Binding affinity to HIV1 reverse transcriptase K65R mutant by pre-steady state kinetics study
Ligand InfoKEGGPC cidPC sid
In DepthDetails ArticlePubMed