BDBM50485550 CHEBI:17859::Glutarate
SMILES OC(=O)CCCC(O)=O
InChI Key InChIKey=JFCQEDHGNNZCLN-UHFFFAOYSA-N
Data  1 IC50
PDB links: 16 PDB IDs match this monomer.
  Tab Delimited (TSV)   2D SDfile   Computed 3D by Vconf -m prep SDfile
Find this compound or compounds like it in BindingDB:
Activity Spreadsheet -- Enzyme Inhibition Constant Data from BindingDB
Found 1 hit for monomerid = 50485550
TargetSolute carrier family 22 member 6(Homo sapiens (Human))
Gilead Sciences
Curated by ChEMBL
LigandPNGBDBM50485550(CHEBI:17859 | Glutarate)
Affinity DataIC50:  4.90E+3nM. Assay description: TP_TRANSPORTER: inhibition of 6-Carboxyfluorescein uptake in OAT1-expressing CHO cells
In DepthDetails ArticlePubMed