BDBM50487066 2,6-DICHLOROPHENYLAMINOMETHYLENEBISPHOSPHONIC ACID
SMILES OP(O)(=O)C(Nc1c(Cl)cccc1Cl)P(O)(O)=O
InChI Key InChIKey=KGPZOMGTNDRRAI-UHFFFAOYSA-N
Data  4 IC50
  Tab Delimited (TSV)   2D SDfile   Computed 3D by Vconf -m prep SDfile
Find this compound or compounds like it in BindingDB:
Activity Spreadsheet -- Enzyme Inhibition Constant Data from BindingDB
Found 4 hits for monomerid = 50487066
TargetGlutamine synthetase, chloroplastic(Zea mays)
University Of Ferrara
Curated by ChEMBL
LigandPNGBDBM50487066(2,6-DICHLOROPHENYLAMINOMETHYLENEBISPHOSPHONIC ACID)
Affinity DataIC50:  1.50E+4nM. Assay description: Inhibition of Zea mays cv. Jeff (maize) leaf glutamine synthetase using L-glutamate as substrate assessed as inorganic phosphate production after 20 ...
Ligand InfoPC cidPC sid
In DepthDetails ArticlePubMed
TargetPyrroline-5-carboxylate reductase(Arabidopsis thaliana)
University Of Ferrara
Curated by ChEMBL
LigandPNGBDBM50487066(2,6-DICHLOROPHENYLAMINOMETHYLENEBISPHOSPHONIC ACID)
Affinity DataIC50:  1.12E+5nM. Assay description: Inhibition of Arabidopsis thaliana P5C assessed as reduction in NADH oxidation incubated at 35 degC up to 10 min
Ligand InfoPC cidPC sid
In DepthDetails ArticlePubMed
TargetPyrroline-5-carboxylate reductase(Arabidopsis thaliana)
University Of Ferrara
Curated by ChEMBL
LigandPNGBDBM50487066(2,6-DICHLOROPHENYLAMINOMETHYLENEBISPHOSPHONIC ACID)
Affinity DataIC50:  1.12E+5nM. Assay description: Inhibition of Arabidopsis thaliana P5C assessed as reduction in NADH oxidation incubated at 35 degC up to 10 min
Ligand InfoPC cidPC sid
In DepthDetails ArticlePubMed
TargetGlutamine synthetase, chloroplastic(Zea mays)
University Of Ferrara
Curated by ChEMBL
LigandPNGBDBM50487066(2,6-DICHLOROPHENYLAMINOMETHYLENEBISPHOSPHONIC ACID)
Affinity DataIC50:  1.50E+4nM. Assay description: Inhibition of Zea mays cv. Jeff (maize) leaf glutamine synthetase using L-glutamate as substrate assessed as inorganic phosphate production after 20 ...
Ligand InfoPC cidPC sid
In DepthDetails ArticlePubMed